Reaction Details
TargetHistamine H2 receptor
LigandBDBM50440992
Substrate/Competitorn/a
Meas. Tech.ChEMBL_985420 (CHEMBL2432449)
Ki 1480±n/a nM
Citation Banister, SDManoli, MBarron, MLWerry, ELKassiou, M N-substituted 8-aminopentacyclo[5.4.0.0(2,6).0(3,10).0(5,9)]undecanes ass receptor ligands with potential neuroprotective effects. Bioorg Med Chem21:6038-52 (2013) 
 
Histamine H2 receptor
Name:Histamine H2 receptor
Type:G Protein-Coupled Receptor (GPCR)
Mol. Mass.:40115.31
Organism:Homo sapiens (Human)
Description:n/a
Residue:359
BDBM50440992
NameBDBM50440992
Synonyms:CHEMBL2432046
TypeSmall organic molecule
Emp. Form.C20H25NO2
Mol. Mass.311.418
SMILESCOc1ccc(CN[C@@H]2C3C4CC5C6CC(C3C46)C25)cc1OC