Reaction Details
TargetHistamine H1 receptor
LigandBDBM50440999
Substrate/Competitorn/a
Meas. Tech.ChEMBL_985421 (CHEMBL2432450)
Ki>10000±n/a nM
Citation Banister, SDManoli, MBarron, MLWerry, ELKassiou, M N-substituted 8-aminopentacyclo[5.4.0.0(2,6).0(3,10).0(5,9)]undecanes ass receptor ligands with potential neuroprotective effects. Bioorg Med Chem21:6038-52 (2013) 
 
Histamine H1 receptor
Name:Histamine H1 receptor
Type:G Protein-Coupled Receptor (GPCR)
Mol. Mass.:55808.72
Organism:Homo sapiens (Human)
Description:Cell pellets from SK-N-MC cells transfected with human H1 receptor were used in binding assay.
Residue:487
BDBM50440999
NameBDBM50440999
Synonyms:CHEMBL2432052
TypeSmall organic molecule
Emp. Form.C20H22FNO
Mol. Mass.311.3932
SMILESCN(CCc1cccc(F)c1)[C@@H]1C2C3C4C2C(=O)C2C4CC3C12