Reaction Details
TargetAromatase
LigandBDBM23419
Substrate/Competitorn/a
Meas. Tech.ChEMBL_984626 (CHEMBL2434281)
IC50 3300±n/a nM
Citation Martin, GDNarvaez, JMarti, A Synthesis and bioconversions of formestane. J Nat Prod76:1966-9 (2013) 
 
Aromatase
Name:Aromatase
Type:Enzyme
Mol. Mass.:57888.92
Organism:Homo sapiens (Human)
Description:P11511
Residue:503
BDBM23419
NameBDBM23419
Synonyms:(2S)-5,7-dihydroxy-2-(4-hydroxyphenyl)-3,4-dihydro-2H-1-benzopyran-4-one Naringenin
Typeflavanone
Emp. Form.C15H12O5
Mol. Mass.272.2528
SMILESOc1ccc(cc1)[C@@H]1CC(=O)c2c(O)cc(O)cc2O1