Reaction Details
TargetPoly [ADP-ribose] polymerase 1
LigandBDBM50441357
Substrate/Competitorn/a
Meas. Tech.ChEMBL_984398 (CHEMBL2433122)
IC50 5623±n/a nM
Citation Narwal, MKoivunen, JHaikarainen, TObaji, ELegala, OEVenkannagari, HJoensuu, PPihlajaniemi, TLehtiö, L Discovery of tankyrase inhibiting flavones with increased potency and isoenzyme selectivity. J Med Chem56:7880-9 (2013) 
 
Poly [ADP-ribose] polymerase 1
Name:Poly [ADP-ribose] polymerase 1
Type:n/a
Mol. Mass.:113114.22
Organism:Homo sapiens (Human)
Description:P09874
Residue:1014
BDBM50441357
NameBDBM50441357
Synonyms:CHEMBL2431805
TypeSmall organic molecule
Emp. Form.C14H11F3N2OS
Mol. Mass.312.31
SMILESFC(F)(F)c1ccc(cc1)-c1nc2CSCCc2c(=O)[nH]1