Reaction Details
TargetHepatocyte growth factor receptor
LigandBDBM50441414
Substrate/Competitorn/a
Meas. Tech.ChEMBL_987834 (CHEMBL2437782)
IC50 16±n/a nM
Citation Tang, QZhao, YDu, XChong, LGong, PGuo, C Design, synthesis, and structure-activity relationships of novel 6,7-disubstituted-4-phenoxyquinoline derivatives as potential antitumor agents. Eur J Med Chem69:77-89 (2013) 
 
Hepatocyte growth factor receptor
Name:Hepatocyte growth factor receptor
Type:Protein
Mol. Mass.:155559.73
Organism:Homo sapiens (Human)
Description:P08581
Residue:1390
BDBM50441414
NameBDBM50441414
Synonyms:CHEMBL2435965
TypeSmall organic molecule
Emp. Form.C34H31F2N5O4
Mol. Mass.611.6378
SMILESCOc1cc2c(Oc3ccc(NC(=O)c4nccc(n4)-c4ccc(F)cc4)cc3F)ccnc2cc1OCCCN1CCCC1