Reaction Details
TargetHeme oxygenase 2
LigandBDBM50441425
Substrate/Competitorn/a
Meas. Tech.ChEMBL_988011 (CHEMBL2438669)
IC50 2600±n/a nM
Citation Vlahakis, JZVukomanovic, DNakatsu, KSzarek, WA Selective inhibition of heme oxygenase-2 activity by analogs of 1-(4-chlorobenzyl)-2-(pyrrolidin-1-ylmethyl)-1H-benzimidazole (clemizole): Exploration of the effects of substituents at the N-1 position. Bioorg Med Chem21:6788-95 (2013) 
 
Heme oxygenase 2
Name:Heme oxygenase 2
Type:Enzyme
Mol. Mass.:35754.99
Organism:Rattus norvegicus (rat)
Description:HO-2 obtained from rat brain was used in enzyme assays.
Residue:315
BDBM50441425
NameBDBM50441425
Synonyms:CHEMBL2436276
TypeSmall organic molecule
Emp. Form.C19H20BrN3
Mol. Mass.370.286
SMILESBrc1ccc(Cn2c(CN3CCCC3)nc3ccccc23)cc1