Reaction Details
TargetLeucine-rich repeat serine/threonine-protein kinase 2
LigandBDBM50441571
Substrate/Competitorn/a
Meas. Tech.ChEMBL_988746 (CHEMBL2439119)
IC50 5.0±n/a nM
Citation Goodfellow, VSLoweth, CJRavula, SBWiemann, TNguyen, TXu, YTodd, DESheppard, DPollack, SPolesskaya, OMarker, DFDewhurst, SGelbard, HA Discovery, synthesis, and characterization of an orally bioavailable, brain penetrant inhibitor of mixed lineage kinase 3. J Med Chem56:8032-48 (2013) 
 
Leucine-rich repeat serine/threonine-protein kinase 2
Name:Leucine-rich repeat serine/threonine-protein kinase 2
Type:Protein
Mol. Mass.:286113.20
Organism:Homo sapiens (Human)
Description:Q5S007
Residue:2527
BDBM50441571
NameBDBM50441571
Synonyms:CHEMBL2436982 US9814704, Example 18
TypeSmall organic molecule
Emp. Form.C21H20N4O3
Mol. Mass.376.4085
SMILESCOc1cc(cc(OC)c1OC)-c1cnc2[nH]cc(-c3ccc(N)nc3)c2c1