Reaction Details
TargetMitogen-activated protein kinase kinase kinase 11
LigandBDBM356235
Substrate/Competitorn/a
Meas. Tech.ChEMBL_986643 (CHEMBL2437703)
IC50 3.0±n/a nM
Citation Goodfellow, VSLoweth, CJRavula, SBWiemann, TNguyen, TXu, YTodd, DESheppard, DPollack, SPolesskaya, OMarker, DFDewhurst, SGelbard, HA Discovery, synthesis, and characterization of an orally bioavailable, brain penetrant inhibitor of mixed lineage kinase 3. J Med Chem56:8032-48 (2013) 
 
Mitogen-activated protein kinase kinase kinase 11
Name:Mitogen-activated protein kinase kinase kinase 11
Type:PROTEIN
Mol. Mass.:92696.93
Organism:Homo sapiens (Human)
Description:ChEMBL_1460565
Residue:847
BDBM356235
NameBDBM356235
Synonyms:BDBM50441572 US9814704, Example 36
Typen/a
Emp. Form.C24H21N3O3
Mol. Mass.399.4418
SMILESCOc1cc(cc(OC)c1OC)-c1cnc2[nH]cc(-c3ccc4[nH]ccc4c3)c2c1