Reaction Details
TargetBromodomain-containing protein 2
LigandBDBM50365462
Substrate/Competitorn/a
Meas. Tech.ChEMBL_988296 (CHEMBL2439862)
IC50 28000±n/a nM
Citation Vidler, LRFilippakopoulos, PFedorov, OPicaud, SMartin, STomsett, MWoodward, HBrown, NKnapp, SHoelder, S Discovery of novel small-molecule inhibitors of BRD4 using structure-based virtual screening. J Med Chem56:8073-88 (2013) 
 
Bromodomain-containing protein 2
Name:Bromodomain-containing protein 2
Type:Protein
Mol. Mass.:88085.95
Organism:Homo sapiens (Human)
Description:P25440
Residue:801
BDBM50365462
NameBDBM50365462
Synonyms:CHEMBL1738777
TypeSmall organic molecule
Emp. Form.C17H16N4S2
Mol. Mass.340.466
SMILESCn1c2ccccc2n(CCSc2nc3ccccc3[nH]2)c1=S