Reaction Details
TargetTyrosine-protein phosphatase non-receptor type 1
LigandBDBM50441781
Substrate/Competitorn/a
Meas. Tech.ChEMBL_988373 (CHEMBL2437800)
IC50 770±n/a nM
Citation Chen, YTTang, CLMa, WPGao, LXWei, YZhang, WLi, JYLi, JNan, FJ Design, synthesis, and biological evaluation of novel 2-ethyl-5-phenylthiazole-4-carboxamide derivatives as protein tyrosine phosphatase 1B inhibitors with improved cellular efficacy. Eur J Med Chem69:399-412 (2013) 
 
Tyrosine-protein phosphatase non-receptor type 1
Name:Tyrosine-protein phosphatase non-receptor type 1
Type:Protein phosphatase
Mol. Mass.:49963.76
Organism:Homo sapiens (Human)
Description:Human recombinant GST-fusion PTP1B (1-435).
Residue:435
BDBM50441781
NameBDBM50441781
Synonyms:CHEMBL2436043
TypeSmall organic molecule
Emp. Form.C43H35FN4O5S
Mol. Mass.738.825
SMILESOC(=O)c1ccc(NC(=O)c2nc(sc2-c2ccccc2)[C@H](Cc2ccc(OCc3ccccc3)cc2)NC(=O)CCc2c[nH]c3ccccc23)c(F)c1