Reaction Details
TargetLeukotriene A-4 hydrolase
LigandBDBM50441911
Substrate/Competitorn/a
Meas. Tech.ChEMBL_987635 (CHEMBL2439368)
Ki 1640±n/a nM
Citation Ali, AREl-Bendary, ERGhaly, MAShehata, IA Novel acetamidothiazole derivatives: synthesis and in vitro anticancer evaluation. Eur J Med Chem69:908-19 (2013) 
 
Leukotriene A-4 hydrolase
Name:Leukotriene A-4 hydrolase
Type:Hydrolase; metalloprotease
Mol. Mass.:69280.41
Organism:Homo sapiens (Human)
Description:Human recombinant LTA4H.
Residue:611
BDBM50441911
NameBDBM50441911
Synonyms:CHEMBL2437294
TypeSmall organic molecule
Emp. Form.C18H22N4O2S
Mol. Mass.358.458
SMILESCC(=O)N1CCN(CC1)C(=O)Cn1c(csc1=N)-c1ccc(C)cc1