Reaction Details
TargetLeukotriene A-4 hydrolase
LigandBDBM50441914
Substrate/Competitorn/a
Meas. Tech.ChEMBL_987635 (CHEMBL2439368)
Ki 369±n/a nM
Citation Ali, AREl-Bendary, ERGhaly, MAShehata, IA Novel acetamidothiazole derivatives: synthesis and in vitro anticancer evaluation. Eur J Med Chem69:908-19 (2013) 
 
Leukotriene A-4 hydrolase
Name:Leukotriene A-4 hydrolase
Type:Hydrolase; metalloprotease
Mol. Mass.:69280.41
Organism:Homo sapiens (Human)
Description:Human recombinant LTA4H.
Residue:611
BDBM50441914
NameBDBM50441914
Synonyms:CHEMBL2437296
TypeSmall organic molecule
Emp. Form.C17H22N4OS
Mol. Mass.330.448
SMILESCN1CCN(CC1)C(=O)Cn1c(csc1=N)-c1ccc(C)cc1