Reaction Details
TargetLeukotriene A-4 hydrolase
LigandBDBM50441916
Substrate/Competitorn/a
Meas. Tech.ChEMBL_987635 (CHEMBL2439368)
Ki 629±n/a nM
Citation Ali, AREl-Bendary, ERGhaly, MAShehata, IA Novel acetamidothiazole derivatives: synthesis and in vitro anticancer evaluation. Eur J Med Chem69:908-19 (2013) 
 
Leukotriene A-4 hydrolase
Name:Leukotriene A-4 hydrolase
Type:Hydrolase; metalloprotease
Mol. Mass.:69280.41
Organism:Homo sapiens (Human)
Description:Human recombinant LTA4H.
Residue:611
BDBM50441916
NameBDBM50441916
Synonyms:CHEMBL2437300
TypeSmall organic molecule
Emp. Form.C16H20N4OS
Mol. Mass.316.421
SMILESCN1CCN(CC1)C(=O)Cn1c(csc1=N)-c1ccccc1