Reaction Details
TargetLeukotriene A-4 hydrolase
LigandBDBM50441917
Substrate/Competitorn/a
Meas. Tech.ChEMBL_987635 (CHEMBL2439368)
Ki 3560±n/a nM
Citation Ali, AREl-Bendary, ERGhaly, MAShehata, IA Novel acetamidothiazole derivatives: synthesis and in vitro anticancer evaluation. Eur J Med Chem69:908-19 (2013) 
 
Leukotriene A-4 hydrolase
Name:Leukotriene A-4 hydrolase
Type:Hydrolase; metalloprotease
Mol. Mass.:69280.41
Organism:Homo sapiens (Human)
Description:Human recombinant LTA4H.
Residue:611
BDBM50441917
NameBDBM50441917
Synonyms:CHEMBL2437299
TypeSmall organic molecule
Emp. Form.C16H19N3O2S
Mol. Mass.317.406
SMILESCc1ccc(cc1)-c1csc(=N)n1CC(=O)N1CCOCC1