Reaction Details
TargetThymidylate synthase
LigandBDBM50441918
Substrate/Competitorn/a
Meas. Tech.ChEMBL_987636 (CHEMBL2439369)
Ki 3730±n/a nM
Citation Ali, AREl-Bendary, ERGhaly, MAShehata, IA Novel acetamidothiazole derivatives: synthesis and in vitro anticancer evaluation. Eur J Med Chem69:908-19 (2013) 
 
Thymidylate synthase
Name:Thymidylate synthase
Type:Enzyme
Mol. Mass.:35718.07
Organism:Homo sapiens (Human)
Description:n/a
Residue:313
BDBM50441918
NameBDBM50441918
Synonyms:CHEMBL2437302
TypeSmall organic molecule
Emp. Form.C15H16ClN3O2S
Mol. Mass.337.824
SMILESClc1ccc(cc1)-c1csc(=N)n1CC(=O)N1CCOCC1