Reaction Details
TargetThymidylate synthase
LigandBDBM50441919
Substrate/Competitorn/a
Meas. Tech.ChEMBL_987636 (CHEMBL2439369)
Ki 6220±n/a nM
Citation Ali, AREl-Bendary, ERGhaly, MAShehata, IA Novel acetamidothiazole derivatives: synthesis and in vitro anticancer evaluation. Eur J Med Chem69:908-19 (2013) 
 
Thymidylate synthase
Name:Thymidylate synthase
Type:Enzyme
Mol. Mass.:35718.07
Organism:Homo sapiens (Human)
Description:n/a
Residue:313
BDBM50441919
NameBDBM50441919
Synonyms:CHEMBL2437301
TypeSmall organic molecule
Emp. Form.C15H17N3O2S
Mol. Mass.303.379
SMILESN=c1scc(-c2ccccc2)n1CC(=O)N1CCOCC1