Reaction Details
Target2-acylglycerol O-acyltransferase 2
LigandBDBM50442178
Substrate/Competitorn/a
Meas. Tech.ChEMBL_991049 (CHEMBL2446068)
IC50 7.0±n/a nM
Citation Abdel-Magid, AF Fighting Obesity and Metabolic Disorders with MGAT-2 Inhibitors. ACS Med Chem Lett4:898-9 (2013) 
 
2-acylglycerol O-acyltransferase 2
Name:2-acylglycerol O-acyltransferase 2
Type:Enzyme
Mol. Mass.:38210.80
Organism:Homo sapiens (Human)
Description:Q3SYC2
Residue:334
BDBM50442178
NameBDBM50442178
Synonyms:CHEMBL2441600 | US9187424, 124
TypeSmall organic molecule
Emp. Form.C31H28F6N2O4
Mol. Mass.606.5554
SMILESCOc1ccc(NC(=O)C2=C(CC(NC2=O)(c2ccc(OCCCC(F)(F)F)cc2)C(F)(F)F)c2ccc(C)cc2)cc1