Reaction Details
TargetTissue alpha-L-fucosidase
LigandBDBM50442345
Substrate/Competitorn/a
Meas. Tech.ChEMBL_990949 (CHEMBL2445277)
IC50 30±n/a nM
Citation Kato, AOkaki, TIfuku, SSato, KHirokami, YIwaki, RKamori, ANakagawa, SAdachi, IKiria, PGOnomura, OMinato, DSugimoto, KMatsuya, YToyooka, N Synthesis and biological evaluation of N-(2-fluorophenyl)-2ß-deoxyfuconojirimycin acetamide as a potent inhibitor fora-l-fucosidases. Bioorg Med Chem21:6565-73 (2013) 
 
Tissue alpha-L-fucosidase
Name:Tissue alpha-L-fucosidase
Type:PROTEIN
Mol. Mass.:53690.69
Organism:Homo sapiens (Human)
Description:ChEMBL_34088
Residue:466
BDBM50442345
NameBDBM50442345
Synonyms:CHEMBL2442782
TypeSmall organic molecule
Emp. Form.C15H22N2O4
Mol. Mass.294.3462
SMILESC[C@@H]1N[C@H](CC(=O)Nc2cccc(C)c2)[C@@H](O)[C@H](O)[C@@H]1O