Reaction Details
TargetTissue alpha-L-fucosidase
LigandBDBM50442338
Substrate/Competitorn/a
Meas. Tech.ChEMBL_990951 (CHEMBL2445279)
IC50 42±n/a nM
Citation Kato, AOkaki, TIfuku, SSato, KHirokami, YIwaki, RKamori, ANakagawa, SAdachi, IKiria, PGOnomura, OMinato, DSugimoto, KMatsuya, YToyooka, N Synthesis and biological evaluation of N-(2-fluorophenyl)-2ß-deoxyfuconojirimycin acetamide as a potent inhibitor fora-l-fucosidases. Bioorg Med Chem21:6565-73 (2013) 
 
Tissue alpha-L-fucosidase
Name:Tissue alpha-L-fucosidase
Type:PROTEIN
Mol. Mass.:54093.12
Organism:Bos taurus
Description:ChEMBL_335897
Residue:468
BDBM50442338
NameBDBM50442338
Synonyms:CHEMBL2442773
TypeSmall organic molecule
Emp. Form.C14H18F2N2O4
Mol. Mass.316.3005
SMILESC[C@@H]1N[C@H](CC(=O)Nc2ccc(F)cc2F)[C@@H](O)[C@H](O)[C@@H]1O