Reaction Details
TargetAminopeptidase N
LigandBDBM23971
Substrate/Competitorn/a
Meas. Tech.ChEMBL_989564 (CHEMBL2444620)
Ki 3500±n/a nM
Citation Al-Lakkis-Wehbe, MChaillou, BDefoin, AAlbrecht, STarnus, C Synthesis of amino-hydroxy-benzocycloheptenones as potent, selective, non-peptidic dinuclear zinc metalloaminopeptidase inhibitors. Bioorg Med Chem21:6447-55 (2013) 
 
Aminopeptidase N
Name:Aminopeptidase N
Type:Protein
Mol. Mass.:108810.25
Organism:Sus scrofa (Pig)
Description:P15145
Residue:963
BDBM23971
NameBDBM23971
Synonyms:(2S)-2-[(2S,3R)-3-amino-2-hydroxy-4-phenylbutanamido]-4-methylpentanoic acid CHEMBL29292 | Ubenimex
TypeSmall organic molecule
Emp. Form.C16H24N2O4
Mol. Mass.308.3728
SMILESCC(C)C[C@H](NC(=O)[C@@H](O)[C@H](N)Cc1ccccc1)C(O)=O