Reaction Details
TargetSodium/glucose cotransporter 2
LigandBDBM50442485
Substrate/Competitorn/a
Meas. Tech.ChEMBL_990145 (CHEMBL2444340)
EC50>50000±n/a nM
Citation Lin, TSLiw, YWSong, JSHsieh, TCYeh, HWHsu, LCLin, CJWu, SHLiang, PH Synthesis and biological evaluation of novel C-aryl d-glucofuranosides as sodium-dependent glucose co-transporter 2 inhibitors. Bioorg Med Chem21:6282-91 (2013) 
 
Sodium/glucose cotransporter 2
Name:Sodium/glucose cotransporter 2
Type:Protein
Mol. Mass.:72902.00
Organism:Homo sapiens (Human)
Description:P31639
Residue:672
BDBM50442485
NameBDBM50442485
Synonyms:CHEMBL2440372
TypeSmall organic molecule
Emp. Form.C20H23ClO6
Mol. Mass.394.846
SMILESCOc1cccc(Cc2cc(ccc2Cl)[C@@H]2O[C@H]([C@H](O)CO)[C@H](O)[C@H]2O)c1