Reaction Details
TargetSodium/glucose cotransporter 2
LigandBDBM50442488
Substrate/Competitorn/a
Meas. Tech.ChEMBL_990145 (CHEMBL2444340)
EC50 24000±n/a nM
Citation Lin, TSLiw, YWSong, JSHsieh, TCYeh, HWHsu, LCLin, CJWu, SHLiang, PH Synthesis and biological evaluation of novel C-aryl d-glucofuranosides as sodium-dependent glucose co-transporter 2 inhibitors. Bioorg Med Chem21:6282-91 (2013) 
 
Sodium/glucose cotransporter 2
Name:Sodium/glucose cotransporter 2
Type:Protein
Mol. Mass.:72902.00
Organism:Homo sapiens (Human)
Description:P31639
Residue:672
BDBM50442488
NameBDBM50442488
Synonyms:CHEMBL2440374
TypeSmall organic molecule
Emp. Form.C23H29ClO5
Mol. Mass.420.926
SMILESCC(C)(C)c1ccc(Cc2cc(ccc2Cl)[C@@H]2O[C@H]([C@H](O)CO)[C@H](O)[C@H]2O)cc1