Reaction Details
Target5-hydroxytryptamine receptor 3A
LigandBDBM50388009
Substrate/Competitorn/a
Meas. Tech.ChEMBL_989092 (CHEMBL2445944)
Ki 1511±n/a nM
Citation Lewellyn, KBialonska, DLoria, MJWhite, SWSufka, KJZjawiony, JK In vitro structure-activity relationships of aplysinopsin analogs and their in vivo evaluation in the chick anxiety-depression model. Bioorg Med Chem21:7083-90 (2013) 
 
5-hydroxytryptamine receptor 3A
Name:5-hydroxytryptamine receptor 3A
Type:Protein
Mol. Mass.:55283.27
Organism:Homo sapiens (Human)
Description:P46098
Residue:478
BDBM50388009
NameBDBM50388009
Synonyms:METHYLAPLYSINOPSIN
TypeSmall organic molecule
Emp. Form.C15H16N4O
Mol. Mass.268.3137
SMILESC\N=C1/N(C)C(=O)\C(=C/c2c[nH]c3ccccc23)N1C