Reaction Details
TargetInhibitor of nuclear factor kappa-B kinase subunit beta
LigandBDBM50442758
Substrate/Competitorn/a
Meas. Tech.ChEMBL_989474 (CHEMBL2444001)
IC50>10.0±n/a nM
Citation Brasca, MGMantegani, SAmboldi, NBindi, SCaronni, DCasale, ECeccarelli, WColombo, NDe Ponti, ADonati, DErmoli, AFachin, GFelder, ERFerguson, RDFiorelli, CGuanci, MIsacchi, APesenti, EPolucci, PRiceputi, LSola, FVisco, CZuccotto, FFogliatto, G Discovery of NMS-E973 as novel, selective and potent inhibitor of heat shock protein 90 (Hsp90). Bioorg Med Chem21:7047-63 (2013) 
 
Inhibitor of nuclear factor kappa-B kinase subunit beta
Name:Inhibitor of nuclear factor kappa-B kinase subunit beta
Type:Serine/threonine-protein kinase
Mol. Mass.:86554.39
Organism:Homo sapiens (Human)
Description:GST-tagged IKK-2 was expressed in High Five cells and purified.
Residue:756
BDBM50442758
NameBDBM50442758
Synonyms:CHEMBL2443139
TypeSmall organic molecule
Emp. Form.C25H30N4O5
Mol. Mass.466.5295
SMILESCC(C)Nc1ccc(Oc2cc(O)cc(O)c2-c2cc(no2)C(=O)NC2CCN(C)CC2)cc1