Reaction Details
TargetPlasminogen
LigandBDBM50326056
Substrate/Competitorn/a
Meas. Tech.ChEMBL_990377 (CHEMBL2446013)
IC50 8700±n/a nM
Citation Bondada, LRondla, RPradere, ULiu, PLi, CBobeck, DMcBrayer, TTharnish, PCourcambeck, JHalfon, PWhitaker, TAmblard, FCoats, SJSchinazi, RF Azetidines and spiro azetidines as novel P2 units in hepatitis C virus NS3 protease inhibitors. Bioorg Med Chem Lett23:6325-30 (2013) 
 
Plasminogen
Name:Plasminogen
Type:Enzyme
Mol. Mass.:90579.18
Organism:Homo sapiens (Human)
Description:n/a
Residue:810
BDBM50326056
NameBDBM50326056
Synonyms:(1S,3aR,6aS)-2-((S)-2-((S)-2-cyclohexyl-2-(pyrazine-2-carboxamido)acetamido)-3,3-dimethylbutanoyl)-N-((S)-1-(cyclopropylamino)-1,2-dioxohexan-3-yl)octahydrocyclopenta[c]pyrrole-1-carboxamide (1S,3aR,6aS)-2-((S)-2-((S)-2-cyclohexyl-2-(pyrazine-6-carboxamido)acetamido)-3,3-dimethylbutanoyl)-N-((S)-1-(cyclopropylamino)-1,2-dioxohexan-3-yl)-octahydrocyclopenta[c]pyrrole-1-carboxamide TELAPREVIR VX-950
TypeSmall organic molecule
Emp. Form.C36H53N7O6
Mol. Mass.679.8493
SMILESCCC[C@H](NC(=O)[C@@H]1[C@H]2CCC[C@H]2CN1C(=O)[C@@H](NC(=O)[C@@H](NC(=O)c1cnccn1)C1CCCCC1)C(C)(C)C)C(=O)C(=O)NC1CC1