Reaction Details
TargetSolute carrier organic anion transporter family member 1B3
LigandBDBM50442903
Substrate/Competitorn/a
Meas. Tech.ChEMBL_1265866 (CHEMBL3039492)
IC50 692±n/a nM
Citation De Bruyn, Tvan Westen, GJIjzerman, APStieger, Bde Witte, PAugustijns, PFAnnaert, PP Structure-based identification of OATP1B1/3 inhibitors. Mol Pharmacol83:1257-67 (2013) 
 
Solute carrier organic anion transporter family member 1B3
Name:Solute carrier organic anion transporter family member 1B3
Type:Protein
Mol. Mass.:77425.75
Organism:Homo sapiens (Human)
Description:Q9NPD5
Residue:702
BDBM50442903
NameBDBM50442903
Synonyms:CHEMBL3039411
TypeSmall organic molecule
Emp. Form.C43H54O18
Mol. Mass.858.8781
SMILESCOC(=O)C[C@H]1C2(C)CC34OC5(C)O[C@@]6([C@H](OC(C)=O)[C@@]3(O)C2OC(=O)C(C)C)C2C(C(=O)C(C)C)C(=O)O[C@@H](c3ccoc3)[C@]2(C)C(OC(C)=O)[C@@H](OC(C)=O)[C@]6(O5)[C@]14C