Reaction Details
TargetSolute carrier organic anion transporter family member 1B3
LigandBDBM50442888
Substrate/Competitorn/a
Meas. Tech.ChEMBL_1265866 (CHEMBL3039492)
IC50 724±n/a nM
Citation De Bruyn, Tvan Westen, GJIjzerman, APStieger, Bde Witte, PAugustijns, PFAnnaert, PP Structure-based identification of OATP1B1/3 inhibitors. Mol Pharmacol83:1257-67 (2013) 
 
Solute carrier organic anion transporter family member 1B3
Name:Solute carrier organic anion transporter family member 1B3
Type:Protein
Mol. Mass.:77425.75
Organism:Homo sapiens (Human)
Description:Q9NPD5
Residue:702
BDBM50442888
NameBDBM50442888
Synonyms:CHEMBL3039293
TypeSmall organic molecule
Emp. Form.C43H58O16
Mol. Mass.830.911
SMILESCO[C@@H]1C(OC(=O)C(C)C)[C@@]2(C)[C@@H](OC(=O)\C(C2[C@]23OC4(C)O[C@]12[C@]1(C)[C@@H](CC(=O)OC)C2(C)CC1(O4)[C@](OC)(C2OC(C)=O)[C@H]3OC)=C(/OC)C(C)C)c1ccoc1