Reaction Details
TargetSolute carrier organic anion transporter family member 1B3
LigandBDBM50442905
Substrate/Competitorn/a
Meas. Tech.ChEMBL_1265866 (CHEMBL3039492)
IC50 2884±n/a nM
Citation De Bruyn, Tvan Westen, GJIjzerman, APStieger, Bde Witte, PAugustijns, PFAnnaert, PP Structure-based identification of OATP1B1/3 inhibitors. Mol Pharmacol83:1257-67 (2013) 
 
Solute carrier organic anion transporter family member 1B3
Name:Solute carrier organic anion transporter family member 1B3
Type:Protein
Mol. Mass.:77425.75
Organism:Homo sapiens (Human)
Description:Q9NPD5
Residue:702
BDBM50442905
NameBDBM50442905
Synonyms:CHEMBL1526240 | Dihydrogambogic-acid
TypeSmall organic molecule
Emp. Form.C38H46O8
Mol. Mass.630.767
SMILES[#6]\[#6](-[#6])=[#6]/[#6]-[#6]C1([#6])[#8]-c2c(-[#6]\[#6]=[#6](\[#6])-[#6])c3-[#8]C45[#6]6-[#6]-[#6](-[#6]=[#6]4-[#6](=O)-c3c(-[#8])c2-[#6]=[#6]1)-[#6](-[#8])C5([#6]\[#6]=[#6](\[#6])-[#6](-[#8])=O)[#8]C6([#6])[#6]