Reaction Details
TargetSolute carrier organic anion transporter family member 1B1
LigandBDBM50442908
Substrate/Competitorn/a
Meas. Tech.ChEMBL_1265864 (CHEMBL3039490)
Ki 620±n/a nM
Citation De Bruyn, Tvan Westen, GJIjzerman, APStieger, Bde Witte, PAugustijns, PFAnnaert, PP Structure-based identification of OATP1B1/3 inhibitors. Mol Pharmacol83:1257-67 (2013) 
 
Solute carrier organic anion transporter family member 1B1
Name:Solute carrier organic anion transporter family member 1B1
Type:Protein
Mol. Mass.:76468.06
Organism:Homo sapiens (Human)
Description:Q9Y6L6
Residue:691
BDBM50442908
NameBDBM50442908
Synonyms:CHEMBL1314749
TypeSmall organic molecule
Emp. Form.C38H54O8
Mol. Mass.638.8306
SMILESCC(C)CCCC1(C)Oc2c(CCC(C)C)c3OC45C6CC(CC4C(=O)c3c(O)c2C=C1)C(O)C5(CCC(C)C(O)=O)OC6(C)C