Reaction Details
TargetSolute carrier organic anion transporter family member 1B1
LigandBDBM50005106
Substrate/Competitorn/a
Meas. Tech.ChEMBL_1265864 (CHEMBL3039490)
Ki 370±n/a nM
Citation De Bruyn, Tvan Westen, GJIjzerman, APStieger, Bde Witte, PAugustijns, PFAnnaert, PP Structure-based identification of OATP1B1/3 inhibitors. Mol Pharmacol83:1257-67 (2013) 
 
Solute carrier organic anion transporter family member 1B1
Name:Solute carrier organic anion transporter family member 1B1
Type:Protein
Mol. Mass.:76468.06
Organism:Homo sapiens (Human)
Description:Q9Y6L6
Residue:691
BDBM50005106
NameBDBM50005106
Synonyms:BRL-1702 DICLOXACILLIN SODIUM Dynapen Pathocil
TypeSmall organic molecule
Emp. Form.C19H18Cl2N3NaO6S
Mol. Mass.510.323
SMILESO.[Na+].[H][C@]12SC(C)(C)[C@@H](N1C(=O)[C@H]2NC(=O)c1c(C)onc1-c1c(Cl)cccc1Cl)C([O-])=O