Reaction Details
TargetSolute carrier organic anion transporter family member 1B1
LigandBDBM50442909
Substrate/Competitorn/a
Meas. Tech.ChEMBL_1265864 (CHEMBL3039490)
Ki 590±n/a nM
Citation De Bruyn, Tvan Westen, GJIjzerman, APStieger, Bde Witte, PAugustijns, PFAnnaert, PP Structure-based identification of OATP1B1/3 inhibitors. Mol Pharmacol83:1257-67 (2013) 
 
Solute carrier organic anion transporter family member 1B1
Name:Solute carrier organic anion transporter family member 1B1
Type:Protein
Mol. Mass.:76468.06
Organism:Homo sapiens (Human)
Description:Q9Y6L6
Residue:691
BDBM50442909
NameBDBM50442909
Synonyms:CHEMBL1603825
TypeSmall organic molecule
Emp. Form.C26H26O6
Mol. Mass.434.481
SMILES[#6]-[#8]-c1c(-[#6]\[#6]=[#6](\[#6])-[#6])c2-[#8]C([#6])([#6])[#6]=[#6]-c2c2oc(=O)c(c(-[#8])c12)-c1ccc(-[#8])cc1