Reaction Details
TargetSolute carrier organic anion transporter family member 1B1
LigandBDBM50442872
Substrate/Competitorn/a
Meas. Tech.ChEMBL_1265864 (CHEMBL3039490)
Ki 510±n/a nM
Citation De Bruyn, Tvan Westen, GJIjzerman, APStieger, Bde Witte, PAugustijns, PFAnnaert, PP Structure-based identification of OATP1B1/3 inhibitors. Mol Pharmacol83:1257-67 (2013) 
 
Solute carrier organic anion transporter family member 1B1
Name:Solute carrier organic anion transporter family member 1B1
Type:Protein
Mol. Mass.:76468.06
Organism:Homo sapiens (Human)
Description:Q9Y6L6
Residue:691
BDBM50442872
NameBDBM50442872
Synonyms:CHEMBL3138660
TypeSmall organic molecule
Emp. Form.C29H38O8
Mol. Mass.514.6072
SMILES[H][C@]12C[C@H](OC(C)=O)C(C)(C)[C@H](CC(=O)OC)[C@@]1(C)[C@@]1([H])CC[C@@]3(C)[C@@H](OC(=O)C[C@]3(O2)C1=C)c1ccoc1