Reaction Details
TargetNeuronal acetylcholine receptor subunit alpha-4/beta-2
LigandBDBM82070
Substrate/Competitorn/a
Meas. Tech.ChEMBL_1276107 (CHEMBL3089188)
IC50 370±n/a nM
Citation Yenugonda, VMXiao, YLevin, EDRezvani, AHTran, TAl-Muhtasib, NSahibzada, NXie, TWells, CSlade, SJohnson, JEDakshanamurthy, SKong, HSTomita, YLiu, YPaige, MKellar, KJBrown, ML Design, synthesis and discovery of picomolar selective α4β2 nicotinic acetylcholine receptor ligands. J Med Chem56:8404-21 (2013) 
 
Neuronal acetylcholine receptor subunit alpha-4/beta-2
Name:Neuronal acetylcholine receptor subunit alpha-4/beta-2
Type:Protein
Mol. Mass.:n/a
Description:n/a
Components:This complex has 2 components.
Component 1
Name:Neuronal acetylcholine receptor subunit alpha-4
Synonyms:ACHA4_HUMAN CHRNA4 protein Neuronal acetylcholine receptor protein alpha-4 subunit Nicotinic acetylcholine receptor alpha4/beta2/alpha5
Type:n/a
Mol. Mass.:69963.49
Organism:Homo sapiens (Human)
Description:NACHRA4
Residue:627
Component 2
Name:Neuronal acetylcholine receptor subunit beta-2
Synonyms:ACHB2_HUMAN Neuronal acetylcholine receptor protein beta-2 subunit | Nicotinic acetylcholine receptor alpha3/beta2/alpha5
Type:Protein
Mol. Mass.:57020.50
Organism:Homo sapiens (Human)
Description:P17787
Residue:502
BDBM82070
NameBDBM82070
Synonyms:CAS_29790-52-1 Nicotine-D salicylate US9303017, Nicotine
Typen/a
Emp. Form.C10H14N2
Mol. Mass.162.2316
SMILESCN1CCC[C@H]1c1cccnc1