Reaction Details
TargetNeuronal acetylcholine receptor subunit alpha-3/beta-4
LigandBDBM50442934
Substrate/Competitorn/a
Meas. Tech.ChEMBL_1276116 (CHEMBL3089197)
Ki>1000000±n/a nM
Citation Yenugonda, VMXiao, YLevin, EDRezvani, AHTran, TAl-Muhtasib, NSahibzada, NXie, TWells, CSlade, SJohnson, JEDakshanamurthy, SKong, HSTomita, YLiu, YPaige, MKellar, KJBrown, ML Design, synthesis and discovery of picomolar selective α4β2 nicotinic acetylcholine receptor ligands. J Med Chem56:8404-21 (2013) 
 
Neuronal acetylcholine receptor subunit alpha-3/beta-4
Name:Neuronal acetylcholine receptor subunit alpha-3/beta-4
Type:Protein
Mol. Mass.:n/a
Description:n/a
Components:This complex has 2 components.
Component 1
Name:Neuronal acetylcholine receptor subunit alpha-3
Synonyms:ACHA3_RAT Chrna3
Type:Enzyme
Mol. Mass.:56995.52
Organism:Rattus norvegicus (Rat)
Description:P04757
Residue:499
Component 2
Name:Neuronal acetylcholine receptor subunit beta-4
Synonyms:ACHB4_RAT Chrnb4 Neuronal acetylcholine receptor non-alpha-2 chain | Neuronal acetylcholine receptor protein beta-4 subunit
Type:Enzyme
Mol. Mass.:55863.89
Organism:Rattus norvegicus (Rat)
Description:P12392
Residue:495
BDBM50442934
NameBDBM50442934
Synonyms:CHEMBL3086987
TypeSmall organic molecule
Emp. Form.C18H17NO
Mol. Mass.263.3337
SMILESC(Oc1cncc(c1)C#Cc1ccccc1)C1CCC1