Reaction Details
TargetFatty-acid amide hydrolase 1
LigandBDBM50350547
Substrate/Competitorn/a
Meas. Tech.ChEMBL_1276450 (CHEMBL3088546)
IC50 17±n/a nM
Citation Patel, JZParkkari, TLaitinen, TKaczor, AASaario, SMSavinainen, JRNavia-Paldanius, DCipriano, MLeppänen, JKoshevoy, IOPoso, AFowler, CJLaitinen, JTNevalainen, T Chiral 1,3,4-oxadiazol-2-ones as highly selective FAAH inhibitors. J Med Chem56:8484-96 (2013) 
 
Fatty-acid amide hydrolase 1
Name:Fatty-acid amide hydrolase 1
Type:Protein
Mol. Mass.:63071.19
Organism:Homo sapiens (Human)
Description:O00519
Residue:579
BDBM50350547
NameBDBM50350547
Synonyms:CHEMBL257307
TypeSmall organic molecule
Emp. Form.C18H26N2O2
Mol. Mass.302.4112
SMILESCCCCCCCCCCCC(=O)c1nc2ncccc2o1