Reaction Details
TargetKiSS-1 receptor
LigandBDBM50442966
Substrate/Competitorn/a
Meas. Tech.ChEMBL_1276485 (CHEMBL3088609)
Ki 0.043000±n/a nM
Citation Asami, TNishizawa, NMatsui, HNishibori, KIshibashi, YHorikoshi, YNakayama, MMatsumoto, STarui, NYamaguchi, MMatsumoto, HOhtaki, TKitada, C Design, synthesis, and biological evaluation of novel investigational nonapeptide KISS1R agonists with testosterone-suppressive activity. J Med Chem56:8298-307 (2013) 
 
KiSS-1 receptor
Name:KiSS-1 receptor
Type:PROTEIN
Mol. Mass.:42915.37
Organism:Rattus norvegicus
Description:ChEMBL_1448383
Residue:396
BDBM50442966
NameBDBM50442966
Synonyms:CHEMBL3087927
TypeSmall organic molecule
Emp. Form.C65H85N19O13
Mol. Mass.1340.4899
SMILESCNC(N)=NCCC[C@H](NC(=O)[C@H](CC(C)C)NC(=O)NNC(=O)[C@H](Cc1ccccc1)NC(=O)[C@H](CO)NC(=O)[C@H](CC(N)=O)NC(=O)[C@H](Cc1c[nH]c2ccccc12)NC(=O)[C@@H](Cc1cnc[nH]1)NC(=O)[C@H](N)Cc1ccc(O)cc1)C(=O)N[C@@H](Cc1ccccc1)C(N)=O