Reaction Details
TargetKiSS-1 receptor
LigandBDBM50442976
Substrate/Competitorn/a
Meas. Tech.ChEMBL_1276485 (CHEMBL3088609)
Ki 0.130000±n/a nM
Citation Asami, TNishizawa, NMatsui, HNishibori, KIshibashi, YHorikoshi, YNakayama, MMatsumoto, STarui, NYamaguchi, MMatsumoto, HOhtaki, TKitada, C Design, synthesis, and biological evaluation of novel investigational nonapeptide KISS1R agonists with testosterone-suppressive activity. J Med Chem56:8298-307 (2013) 
 
KiSS-1 receptor
Name:KiSS-1 receptor
Type:PROTEIN
Mol. Mass.:42915.37
Organism:Rattus norvegicus
Description:ChEMBL_1448383
Residue:396
BDBM50442976
NameBDBM50442976
Synonyms:CHEMBL3086280
TypeSmall organic molecule
Emp. Form.C54H79N15O12
Mol. Mass.1130.2984
SMILESCC[C@H](C)[C@H](NC(=O)[C@H](N)Cc1ccc(O)cc1)C(=O)N[C@@H](CC(N)=O)C(=O)N[C@@H](CO)C(=O)N[C@@H](Cc1ccccc1)C(=O)NNC(=O)N[C@@H](CC(C)C)C(=O)N[C@@H](CCCN=C(N)NC)C(=O)N[C@@H](Cc1ccccc1)C(N)=O