Reaction Details
TargetAcetylcholinesterase
LigandBDBM50342601
Substrate/Competitorn/a
Meas. Tech.ChEMBL_1275667 (CHEMBL3090838)
IC50 82±n/a nM
Citation Andersson, CDForsgren, NAkfur, CAllgardsson, ABerg, LEngdahl, CQian, WEkström, FLinusson, A Divergent structure-activity relationships of structurally similar acetylcholinesterase inhibitors. J Med Chem56:7615-24 (2013) 
 
Acetylcholinesterase
Name:Acetylcholinesterase
Type:Enzyme
Mol. Mass.:68165.65
Organism:Mus musculus (mouse)
Description:n/a
Residue:614
BDBM50342601
NameBDBM50342601
Synonyms:CHEMBL1255901 | Huperzine A
TypeSmall organic molecule
Emp. Form.C15H18N2O
Mol. Mass.242.3162
SMILESC\C=C1/[C@@H]2Cc3[nH]c(=O)ccc3[C@]1(N)CC(C)=C2