Reaction Details
TargetHistone acetyltransferase KAT2B
LigandBDBM50443232
Substrate/Competitorn/a
Meas. Tech.ChEMBL_1277429 (CHEMBL3089619)
Ki 5520±n/a nM
Citation Zhang, GPlotnikov, ANRusinova, EShen, TMorohashi, KJoshua, JZeng, LMujtaba, SOhlmeyer, MZhou, MM Structure-guided design of potent diazobenzene inhibitors for the BET bromodomains. J Med Chem56:9251-64 (2013) 
 
Histone acetyltransferase KAT2B
Name:Histone acetyltransferase KAT2B
Type:PROTEIN
Mol. Mass.:93045.76
Organism:Homo sapiens (Human)
Description:ChEMBL_1502838
Residue:832
BDBM50443232
NameBDBM50443232
Synonyms:CHEMBL3086883
TypeSmall organic molecule
Emp. Form.C18H17N5O3S
Mol. Mass.383.424
SMILESCc1cc(N=Nc2ccc(cc2)S(=O)(=O)Nc2ccccn2)c(N)cc1O