Reaction Details
TargetThymidylate synthase
LigandBDBM50443314
Substrate/Competitorn/a
Meas. Tech.ChEMBL_1274589 (CHEMBL3089847)
Ki 1200±n/a nM
Citation Ferrari, SCalò, SLeone, RLuciani, RCostantino, LSammak, SDi Pisa, FPozzi, CMangani, SCosti, MP 2'-Deoxyuridine 5'-monophosphate substrate displacement in thymidylate synthase through 6-hydroxy-2H-naphtho[1,8-bc]furan-2-one derivatives. J Med Chem56:9356-60 (2013) 
 
Thymidylate synthase
Name:Thymidylate synthase
Type:Enzyme
Mol. Mass.:36576.54
Organism:Lactobacillus casei
Description:n/a
Residue:316
BDBM50443314
NameBDBM50443314
Synonyms:CHEMBL3088232
TypeSmall organic molecule
Emp. Form.C18H9NO6
Mol. Mass.335.2672
SMILES[O-][N+](=O)c1ccc(cc1)C(=O)Oc1ccc2OC(=O)c3cccc1c23