Reaction Details
TargetTyrosine-protein phosphatase non-receptor type 1
LigandBDBM50443534
Substrate/Competitorn/a
Meas. Tech.ChEMBL_1275583 (CHEMBL3090684)
IC50>30000±n/a nM
Citation Nguyen, PHYang, JLUddin, MNPark, SLLim, SIJung, DWWilliams, DROh, WK Protein tyrosine phosphatase 1B (PTP1B) inhibitors from Morinda citrifolia (Noni) and their insulin mimetic activity. J Nat Prod76:2080-7 (2013) 
 
Tyrosine-protein phosphatase non-receptor type 1
Name:Tyrosine-protein phosphatase non-receptor type 1
Type:Protein phosphatase
Mol. Mass.:49963.76
Organism:Homo sapiens (Human)
Description:Human recombinant GST-fusion PTP1B (1-435).
Residue:435
BDBM50443534
NameBDBM50443534
Synonyms:CHEMBL3088126
TypeSmall organic molecule
Emp. Form.C18H16O7
Mol. Mass.344.3154
SMILESOC[C@@H]1Oc2cc(\C=C\C(O)=O)ccc2O[C@@H]1c1ccc(O)c(O)c1