Reaction Details
TargetTyrosine-protein phosphatase non-receptor type 1
LigandBDBM50443536
Substrate/Competitorn/a
Meas. Tech.ChEMBL_1275583 (CHEMBL3090684)
IC50>30000±n/a nM
Citation Nguyen, PHYang, JLUddin, MNPark, SLLim, SIJung, DWWilliams, DROh, WK Protein tyrosine phosphatase 1B (PTP1B) inhibitors from Morinda citrifolia (Noni) and their insulin mimetic activity. J Nat Prod76:2080-7 (2013) 
 
Tyrosine-protein phosphatase non-receptor type 1
Name:Tyrosine-protein phosphatase non-receptor type 1
Type:Protein phosphatase
Mol. Mass.:49963.76
Organism:Homo sapiens (Human)
Description:Human recombinant GST-fusion PTP1B (1-435).
Residue:435
BDBM50443536
NameBDBM50443536
Synonyms:CHEMBL3088128
TypeSmall organic molecule
Emp. Form.C19H22O6
Mol. Mass.346.3744
SMILESCOc1cc(ccc1O)[C@H]1Oc2ccc(CCCO)cc2O[C@@H]1CO