Reaction Details
TargetTyrosine-protein phosphatase non-receptor type 1
LigandBDBM50443539
Substrate/Competitorn/a
Meas. Tech.ChEMBL_1275583 (CHEMBL3090684)
IC50 16820±n/a nM
Citation Nguyen, PHYang, JLUddin, MNPark, SLLim, SIJung, DWWilliams, DROh, WK Protein tyrosine phosphatase 1B (PTP1B) inhibitors from Morinda citrifolia (Noni) and their insulin mimetic activity. J Nat Prod76:2080-7 (2013) 
 
Tyrosine-protein phosphatase non-receptor type 1
Name:Tyrosine-protein phosphatase non-receptor type 1
Type:Protein phosphatase
Mol. Mass.:49963.76
Organism:Homo sapiens (Human)
Description:Human recombinant GST-fusion PTP1B (1-435).
Residue:435
BDBM50443539
NameBDBM50443539
Synonyms:(+)-Syringaresinol Dimethyl Ether CHEMBL454592
TypeSmall organic molecule
Emp. Form.C24H30O8
Mol. Mass.446.4902
SMILESCOc1cc(cc(OC)c1OC)[C@H]1OC[C@H]2[C@@H]1CO[C@@H]2c1cc(OC)c(OC)c(OC)c1