Reaction Details
TargetC-X-C chemokine receptor type 4
LigandBDBM50443542
Substrate/Competitorn/a
Meas. Tech.ChEMBL_1278928 (CHEMBL3097228)
IC50 420±n/a nM
Citation Truax, VMZhao, HKatzman, BMProsser, ARAlcaraz, AASaindane, MTHoward, RBCulver, DArrendale, RFGruddanti, PREvers, TJNatchus, MGSnyder, JPLiotta, DCWilson, LJ Discovery of tetrahydroisoquinoline-based CXCR4 antagonists. ACS Med Chem Lett4:1025-30 (2013) 
 
C-X-C chemokine receptor type 4
Name:C-X-C chemokine receptor type 4
Type:Enzyme
Mol. Mass.:39754.61
Organism:Homo sapiens (Human)
Description:P61073
Residue:352
BDBM50443542
NameBDBM50443542
Synonyms:CHEMBL3091686
TypeSmall organic molecule
Emp. Form.C26H37N5O
Mol. Mass.435.6049
SMILESCN(C)C(=O)NCCCCN(C[C@H]1Cc2ccccc2CN1)[C@H]1CCCc2cccnc12