Reaction Details
TargetC-X-C chemokine receptor type 4
LigandBDBM50443545
Substrate/Competitorn/a
Meas. Tech.ChEMBL_1278928 (CHEMBL3097228)
IC50 120±n/a nM
Citation Truax, VMZhao, HKatzman, BMProsser, ARAlcaraz, AASaindane, MTHoward, RBCulver, DArrendale, RFGruddanti, PREvers, TJNatchus, MGSnyder, JPLiotta, DCWilson, LJ Discovery of tetrahydroisoquinoline-based CXCR4 antagonists. ACS Med Chem Lett4:1025-30 (2013) 
 
C-X-C chemokine receptor type 4
Name:C-X-C chemokine receptor type 4
Type:Enzyme
Mol. Mass.:39754.61
Organism:Homo sapiens (Human)
Description:P61073
Residue:352
BDBM50443545
NameBDBM50443545
Synonyms:CHEMBL3091683
TypeSmall organic molecule
Emp. Form.C29H37N5
Mol. Mass.455.6376
SMILESC(CCN(C[C@H]1Cc2ccccc2CN1)[C@H]1CCCc2cccnc12)CNCc1ccccn1