Reaction Details
TargetEndothelial lipase
LigandBDBM50443624
Substrate/Competitorn/a
Meas. Tech.ChEMBL_1279835 (CHEMBL3095694)
IC50 33335±n/a nM
Citation Abdel-Magid, AF Endothelial lipase inhibitors for the treatment of atherosclerosis and cardiovascular disorders. ACS Med Chem Lett4:1016-7 (2013) 
 
Endothelial lipase
Name:Endothelial lipase
Type:Protein
Mol. Mass.:56643.58
Organism:Mus musculus (Mouse)
Description:Q9WVG5
Residue:500
BDBM50443624
NameBDBM50443624
Synonyms:CHEMBL3092449 | US9216998, 28
TypeSmall organic molecule
Emp. Form.C20H18F3NS
Mol. Mass.361.424
SMILESFC(F)(F)c1c(CCCc2ccccc2)n2CCSc3cccc1c23