Reaction Details
TargetSerine/threonine-protein kinase Sgk1
LigandBDBM50443636
Substrate/Competitorn/a
Meas. Tech.ChEMBL_1279843 (CHEMBL3095702)
IC50 3.0±n/a nM
Citation Blass, B N-[4-(1H-Pyrazolo[3,4-B]pyrazin-6yl)-phenyl]-sulonamides and Their Use As Pharmaceuticals. ACS Med Chem Lett4:1022-4 (2013) 
 
Serine/threonine-protein kinase Sgk1
Name:Serine/threonine-protein kinase Sgk1
Type:Other Protein Type
Mol. Mass.:48954.40
Organism:Homo sapiens (Human)
Description:Recombinant human SGK-1 enzyme produced in a baculovirus system.
Residue:431
BDBM50443636
NameBDBM50443636
Synonyms:CHEMBL3092460 US9221828, 1
TypeSmall organic molecule
Emp. Form.C17H12Cl2N6O2S
Mol. Mass.435.287
SMILESNc1n[nH]c2nc(cnc12)-c1ccc(NS(=O)(=O)c2cccc(Cl)c2Cl)cc1