Reaction Details
TargetCyclin-T1/Cyclin-dependent kinase 9
LigandBDBM50347750
Substrate/Competitorn/a
Meas. Tech.ChEMBL_1280772 (CHEMBL3097756)
IC50>10000±n/a nM
Citation Burgy, GTahtouh, TDurieu, EFoll-Josselin, BLimanton, EMeijer, LCarreaux, FBazureau, JP Chemical synthesis and biological validation of immobilized protein kinase inhibitory Leucettines. Eur J Med Chem62:728-37 (2013) 
 
Cyclin-T1/Cyclin-dependent kinase 9
Name:Cyclin-T1/Cyclin-dependent kinase 9
Type:Protein Complex
Mol. Mass.:n/a
Description:n/a
Components:This complex has 2 components.
Component 1
Name:Cyclin-T1
Synonyms:CCNT1 CycT Cyclin T Cyclin-T
Type:Enzyme Subunit
Mol. Mass.:80712.40
Organism:Homo sapiens (Human)
Description:n/a
Residue:726
Component 2
Name:Cyclin-dependent kinase 9
Synonyms:C-2K CDK9 Cell division cycle 2-like protein kinase 4 Cyclin-Dependent Kinase 9 (CDK9) Serine/threonine-protein kinase PITALRE Tat-associated kinase complex catalytic subunit
Type:Enzyme Subunit
Mol. Mass.:42789.13
Organism:Homo sapiens (Human)
Description:n/a
Residue:372
BDBM50347750
NameBDBM50347750
Synonyms:CHEMBL1802358
TypeSmall organic molecule
Emp. Form.C17H13N3O3
Mol. Mass.307.3034
SMILESO=C1NC(Nc2ccccc2)=NC1=Cc1ccc2OCOc2c1