Reaction Details
TargetDual specificity tyrosine-phosphorylation-regulated kinase 1A
LigandBDBM50443639
Substrate/Competitorn/a
Meas. Tech.ChEMBL_1280766 (CHEMBL3097750)
IC50 50±n/a nM
Citation Burgy, GTahtouh, TDurieu, EFoll-Josselin, BLimanton, EMeijer, LCarreaux, FBazureau, JP Chemical synthesis and biological validation of immobilized protein kinase inhibitory Leucettines. Eur J Med Chem62:728-37 (2013) 
 
Dual specificity tyrosine-phosphorylation-regulated kinase 1A
Name:Dual specificity tyrosine-phosphorylation-regulated kinase 1A
Type:Enzyme
Mol. Mass.:85616.61
Organism:Homo sapiens (Human)
Description:Q13627
Residue:763
BDBM50443639
NameBDBM50443639
Synonyms:CHEMBL3092862
TypeSmall organic molecule
Emp. Form.C23H26N4O6
Mol. Mass.454.4757
SMILESNCCOCCOCCOc1ccc(NC2=NC(=Cc3ccc4OCOc4c3)C(=O)N2)cc1