Reaction Details
TargetDual specificity protein kinase CLK4
LigandBDBM50443641
Substrate/Competitorn/a
Meas. Tech.ChEMBL_1280767 (CHEMBL3097751)
IC50>10000±n/a nM
Citation Burgy, GTahtouh, TDurieu, EFoll-Josselin, BLimanton, EMeijer, LCarreaux, FBazureau, JP Chemical synthesis and biological validation of immobilized protein kinase inhibitory Leucettines. Eur J Med Chem62:728-37 (2013) 
 
Dual specificity protein kinase CLK4
Name:Dual specificity protein kinase CLK4
Type:PROTEIN
Mol. Mass.:57374.39
Organism:Mus musculus
Description:ChEMBL_1502248
Residue:481
BDBM50443641
NameBDBM50443641
Synonyms:CHEMBL3092860
TypeSmall organic molecule
Emp. Form.C16H13N3O
Mol. Mass.263.2939
SMILESO=C1NC(Nc2ccccc2)=NC1=Cc1ccccc1